{"text_format":"1","workbook":"xlsx","n_sheets":4,"sheets":["Quote","Setup","Items","Notes"],"not_rendered":{"charts":0,"images":1,"macros":1,"external_links":1,"defined_names":74,"comments":0,"pivot_tables":0},"unopened":[],"bounds":{"document_bytes":16777216,"sheet_cells":100000,"rows_first":2000,"rows_last":500,"rows_between":2000,"halvings":0,"cell_chars":16384,"cell_head_chars":4096},"cells_cut":0,"cells_raw":0,"read":"whole","date_system":"1900"}

{"sheet":"Quote","index":0,"n_rows":75,"n_cols":9,"rows_kept":75,"cut":false,"hidden":false,"merged":[[45,1,45,4],[51,5,52,5],[51,4,52,4],[51,1,52,1],[51,2,52,3],[50,2,50,3],[47,1,47,4],[1,1,1,5],[2,1,2,5],[3,1,3,5],[4,1,4,5],[5,1,5,5],[74,1,74,2],[56,1,56,5],[58,1,58,5],[60,1,60,5],[62,1,62,5],[59,1,59,5],[61,1,61,5],[63,1,63,5],[72,1,72,5],[73,1,73,5],[64,1,64,5],[65,1,65,5],[66,1,66,5],[68,1,68,5],[69,1,69,5],[70,1,70,5],[71,1,71,5],[9,4,9,5],[53,1,53,5],[6,4,6,5],[7,4,7,5],[6,2,6,3],[7,2,7,3],[8,2,8,3],[9,2,9,3],[10,1,10,5],[8,4,8,5],[67,1,67,5],[54,1,54,5],[55,1,55,5],[57,1,57,5],[49,1,49,5]]}
[]
[null," "]
[null,{"$f":"COMPANY&\"   ABN - \"&ABN","v":"Automatic Solutions Australia   ABN - 56 118 383 574"}]
[null,{"$f":"TAS&\"   \"&ADDRESS","v":"Automatic Gate Solutions   146 Bannister Road Canning Vale WA 6155"}]
[null,{"$f":"SALESPERSON&\"   \"&TELEPHONE&\"   Email- \"&EMAIL","v":"Paul Bindon   61 8 94563901   Email- sales@automaticsolutions.com.au"}]
[null," "]
[null,"CLIENT -",null,null,"DATE"]
[null,"SITE -",null,null,{"$f":"TODAY()","v":"2024-06-28"}]
[null,"PHONE -",null,null,"QUOTE NUMBER"]
[null,"EMAIL -"]
[null," "]
[null,"QTY","ITEM","DESCRIPTION","RETAIL","DISCOUNTED"]
[null,null,null,{"$f":"IF(ISBLANK(C13),\"\",VLOOKUP(C13,[0]!ITEMS,2,FALSE))","v":""},{"$f":"IF(ISBLANK(C13),\"\",VLOOKUP(C13,[0]!ITEMS,3,FALSE))","v":""},{"$f":"IF(ISBLANK(C13),\"\",((B13*E13)*0.68181))","v":""},null,null," "]
[null,null,null,{"$f":"IF(ISBLANK(C14),\"\",VLOOKUP(C14,[0]!ITEMS,2,FALSE))","v":""},{"$f":"IF(ISBLANK(C14),\"\",VLOOKUP(C14,[0]!ITEMS,3,FALSE))","v":""},{"$f":"IF(ISBLANK(C14),\"\",((B14*E14)*0.68181))","v":""}]
[null,null,null,{"$f":"IF(ISBLANK(C15),\"\",VLOOKUP(C15,[0]!ITEMS,2,FALSE))","v":""},{"$f":"IF(ISBLANK(C15),\"\",VLOOKUP(C15,[0]!ITEMS,3,FALSE))","v":""},""]
[null,null,null,{"$f":"IF(ISBLANK(C16),\"\",VLOOKUP(C16,[0]!ITEMS,2,FALSE))","v":""},{"$f":"IF(ISBLANK(C16),\"\",VLOOKUP(C16,[0]!ITEMS,3,FALSE))","v":""},""]
[null,null,null,{"$f":"IF(ISBLANK(C17),\"\",VLOOKUP(C17,[0]!ITEMS,2,FALSE))","v":""},{"$f":"IF(ISBLANK(C17),\"\",VLOOKUP(C17,[0]!ITEMS,3,FALSE))","v":""},""]
[null,null,null,{"$f":"IF(ISBLANK(C18),\"\",VLOOKUP(C18,[0]!ITEMS,2,FALSE))","v":""},{"$f":"IF(ISBLANK(C18),\"\",VLOOKUP(C18,[0]!ITEMS,3,FALSE))","v":""},""]
[null,null,null,{"$f":"IF(ISBLANK(C19),\"\",VLOOKUP(C19,[0]!ITEMS,2,FALSE))","v":""},{"$f":"IF(ISBLANK(C19),\"\",VLOOKUP(C19,[0]!ITEMS,3,FALSE))","v":""},""]
[null,null,null,{"$f":"IF(ISBLANK(C20),\"\",VLOOKUP(C20,[0]!ITEMS,2,FALSE))","v":""},{"$f":"IF(ISBLANK(C20),\"\",VLOOKUP(C20,[0]!ITEMS,3,FALSE))","v":""},""]
[null,null,null,{"$f":"IF(ISBLANK(C21),\"\",VLOOKUP(C21,[0]!ITEMS,2,FALSE))","v":""},{"$f":"IF(ISBLANK(C21),\"\",VLOOKUP(C21,[0]!ITEMS,3,FALSE))","v":""},""]
[null,null,null,{"$f":"IF(ISBLANK(C22),\"\",VLOOKUP(C22,[0]!ITEMS,2,FALSE))","v":""},{"$f":"IF(ISBLANK(C22),\"\",VLOOKUP(C22,[0]!ITEMS,3,FALSE))","v":""},""]
[null,null,null,{"$f":"IF(ISBLANK(C23),\"\",VLOOKUP(C23,[0]!ITEMS,2,FALSE))","v":""},{"$f":"IF(ISBLANK(C23),\"\",VLOOKUP(C23,[0]!ITEMS,3,FALSE))","v":""},""]
[null,null,null,{"$f":"IF(ISBLANK(C24),\"\",VLOOKUP(C24,[0]!ITEMS,2,FALSE))","v":""},{"$f":"IF(ISBLANK(C24),\"\",VLOOKUP(C24,[0]!ITEMS,3,FALSE))","v":""},""]
[null,null,null,{"$f":"IF(ISBLANK(C25),\"\",VLOOKUP(C25,[0]!ITEMS,2,FALSE))","v":""},{"$f":"IF(ISBLANK(C25),\"\",VLOOKUP(C25,[0]!ITEMS,3,FALSE))","v":""},""]
[null,null,null,{"$f":"IF(ISBLANK(C26),\"\",VLOOKUP(C26,[0]!ITEMS,2,FALSE))","v":""},{"$f":"IF(ISBLANK(C26),\"\",VLOOKUP(C26,[0]!ITEMS,3,FALSE))","v":""},""]
[null,null,null,{"$f":"IF(ISBLANK(C27),\"\",VLOOKUP(C27,[0]!ITEMS,2,FALSE))","v":""},{"$f":"IF(ISBLANK(C27),\"\",VLOOKUP(C27,[0]!ITEMS,3,FALSE))","v":""},""]
[null,null,null,{"$f":"IF(ISBLANK(C28),\"\",VLOOKUP(C28,[0]!ITEMS,2,FALSE))","v":""},{"$f":"IF(ISBLANK(C28),\"\",VLOOKUP(C28,[0]!ITEMS,3,FALSE))","v":""},""]
[null,null,null,{"$f":"IF(ISBLANK(C29),\"\",VLOOKUP(C29,[0]!ITEMS,2,FALSE))","v":""},null,""]
[null,null,null,{"$f":"IF(ISBLANK(C30),\"\",VLOOKUP(C30,[0]!ITEMS,2,FALSE))","v":""},null,""]
[null,null,null,{"$f":"IF(ISBLANK(C31),\"\",VLOOKUP(C31,[0]!ITEMS,2,FALSE))","v":""},null,""]
[null,null,null,{"$f":"IF(ISBLANK(C32),\"\",VLOOKUP(C32,[0]!ITEMS,2,FALSE))","v":""},{"$f":"IF(ISBLANK(C32),\"\",VLOOKUP(C32,[0]!ITEMS,3,FALSE))","v":""},""]
[null,null,null,{"$f":"IF(ISBLANK(C33),\"\",VLOOKUP(C33,[0]!ITEMS,2,FALSE))","v":""},{"$f":"IF(ISBLANK(C33),\"\",VLOOKUP(C33,[0]!ITEMS,3,FALSE))","v":""},""]
[null,null,null,{"$f":"IF(ISBLANK(C34),\"\",VLOOKUP(C34,[0]!ITEMS,2,FALSE))","v":""},{"$f":"IF(ISBLANK(C34),\"\",VLOOKUP(C34,[0]!ITEMS,3,FALSE))","v":""},""]
[null,null,null,null,null,""]
[null,null,null,null,null,""]
[null,null,null,null,null,""]
[null,null,null,null,null,""]
[null,null,null,null,null,""]
[null,null,null,null,null,""]
[null,null,null,null,null,""]
[null,null,null,null,null,""]
[null,null,null,null,null,""]
[null,null,null,null,null,""]
[null,null,null,null,null,{"$f":"IF(ISBLANK(C45),\"\",B45*E45)","v":""}]
[null,"PRODUCT TOTAL EXCLUDING GST -",null,null,null,{"$f":"SUM(F13:F45)","v":0}]
[]
[null,"INSTALL ESTIMATE EXCLUDING GST (Subject to site confirmation) -",null,null,null,0]
[]
[null,"Acceptance of proposal - By signing below customer agrees that they have checked all items and services included in the proposal and further agree that they understand all items and services. The customer acknowledges the attached \"Specifications and conditions on which this proposal is based\" and declares that it is in accordance with my specification, mode of operation, control and safety requirements, that the finish and treatment match my environmental concerns, that the warranty terms are suitable to my requirements, that the delivery proposal is acceptable, that the site specific clauses have been noted and that the terms of payment are acceptable."]
[null,"NAME -"]
[null,"SIGN -",null,null,"DATE -"]
[]
[null,"www.automaticgatesolutions.com.au"]
[]
[null,"Customers specification - "]
[]
[null,"Method of operation and control - "]
[]
[null,"Safety accessories included - "]
[]
[null,"Finishes and treatments included - "]
[]
[null,"Proposed delivey schedule - "]
[]
[null,"Warranty and service area - Where product is installed by Automatic Gate Solutions we provide warranty and service during office hours within our service area. Should an installation fall outside of the service area any future service and/or warranty work will be charged travel fees at the then current \"TRAVEL\" fees and charges. Work performed whilst on-site will be charged as applicable at normal rates and any on-sitework deemed warranty will be no charge. Service area is defined as a 35 kilometre radius of our home base."]
[null,"Warranty period - Automatic Gate Solutions can tailor both warranty period and maintenance programs to suit customers requirements. Customers requirements in this regard are noted below and the total price has been adjusted to reflect the required warranty period. "]
[null,"Product warranty period is 24 months from date of handover."]
[null,"Delivery and installation terms - Automatic Gate Solutions agrees to make every reasonable effort to perform to the proposed delivery schedule given that customer accepts the proposal within seven days. Customer understands that after this time delivery schedules can vary based on workload levels and that further enquiry is required to determine the current appropriate delivery schedule."]
[null,"Delays beyond control - Automatic Gate Solutions understands that delays can occur from both a customers point of view and a supply point of view. Acts of god as well as man made acts can cause delay/s beyond control. Automatic Gate Solutions and customer agree to work in harmony to minimise and if possible avoid delay beyond control. Any variation agreed will focus on restoring the proposed delivery schedule. Automatic Gate Solutions and customer agree that any delay beyond control causing departure from the proposed delivery schedule will not constitute reason for cancellation of the proposal or order."]
[null,"Site excavation and discovery of services - Customer understands any and all site excavation required to complete the installation and warrants that they have taken all necessary and reasonable steps to determine that required excavation will not impact on existing services. Customer further agrees that no other enquiry is required by Automatic Gate Solutions in relation to the position of existing services. Customer agrees that any discovery of services requiring relocation will be at customers cost"]
[null,"Existing site conditions - Customer confirms that Automatic Gate Solutions and customer has to the extent possible determined the suitability of the exisiting site and site improvements to accept the installation and its attachments and is satisfied that no further effort in this regard is necessary. Customer agrees that discovery to the contrary requiring further works will be at customers cost. Customer is responsible for compliance with property boundaries. "]
[null,"Third party reliance - Where customer is facilitating either a service or product on which the installation or the performance of any product relies failure of this third party service or product does not constitute a failure of Automatic Gate Solutions or its products. Customer agrees that third party service or product performance and/or changes are outside the control of Automatic Gate Solutions and holds Automatic Gate Solutions harmless from any action, claims, liability or loss in respect of the performance of the services or products."]
[null,"Terms of payment - Payment terms are fifty deposit with order (50%) and the remainder payable at or before handover and commissioning. Payments to the installer may be made by cheque, cash or credit card. All works performed out of service area must be paid in full before any works can be scheduled. Payments by electronic funds transfer (EFT) must be made prior to handover and commissioning.\nCredit Cards Accepted - VISA and MASTERCARD"]
[null,"Bank detail for electronic payment - BSB:",null,{"$f":"BSB&\"   Account number: \"&ACCOUNT","v":"633-000   Account number: 128172079"},"Date - ",{"$f":"TODAY()","v":"2024-06-28"}]

{"sheet":"Setup","index":1,"n_rows":9,"n_cols":2,"rows_kept":9,"cut":false,"hidden":false,"merged":[]}
["Company Name - ","Automatic Solutions Australia"]
["Company ABN - ","56 118 383 574"]
["Trading As - ","Automatic Gate Solutions"]
["Address -","146 Bannister Road Canning Vale WA 6155"]
["Sales Person - ","Paul Bindon"]
["Telephone - ","61 8 94563901"]
["Email - ","sales@automaticsolutions.com.au"]
["Bank BSB - ","633-000"]
["Bank Account No -",128172079]

{"sheet":"Items","index":2,"n_rows":790,"n_cols":9,"rows_kept":790,"cut":false,"hidden":true,"merged":[]}
["Item Name","Description","Selling Price","Search","Frequency","Final List"]
["MB24KIT","MB24KIT - Articulated arm double gate kit (24 volts - 2.5 metres)",3077,{"$f":"IFERROR(SEARCH(INDIRECT(CELL(\"address\")),A2),0)","v":1},{"$f":"IF(D2=0,\"\",COUNTIF($D$2:D2,\">0\"))","v":1},{"$f":"IFERROR(INDEX(A:A,MATCH(ROW(D1),E:E,0)),\"\")","v":"MB24KIT"},null,null," "]
["MB24","MB24 - Articulated arm operator (24 volts - 2.5 metres)",1150,{"$f":"IFERROR(SEARCH(INDIRECT(CELL(\"address\")),A3),0)","v":1},{"$f":"IF(D3=0,\"\",COUNTIF($D$2:D3,\">0\"))","v":2},"MB24"]
["PRPLKIT","PRPLKIT - Longitudinal mounting plate for PR arm operator",130,1,{"$f":"IF(D4=0,\"\",COUNTIF($D$2:D4,\">0\"))","v":3},"PRPLKIT",null,null," "]
["PR24","PR24 - Articulated arm operator (24 volts - 3.0 metres)",1353,1,{"$f":"IF(D5=0,\"\",COUNTIF($D$2:D5,\">0\"))","v":4},"PR24",null,null," "]
["PR24KIT","PR24KIT - Articulated arm double gate kit (24 volts - 3.0 metres)",3481,1,{"$f":"IF(D6=0,\"\",COUNTIF($D$2:D6,\">0\"))","v":5},"PR24KIT"]
["BEAUTYKIT","BEAUTYKIT - Double gate kit (24 volts - 2.0 metres)",1618,1,{"$f":"IF(D7=0,\"\",COUNTIF($D$2:D7,\">0\"))","v":6},"BEAUTYKIT"]
["PRBSKITRH","PRBSKITRH - Right slide arm kit for PR articulated arm operator",340,1,{"$f":"IF(D8=0,\"\",COUNTIF($D$2:D8,\">0\"))","v":7},"PRBSKITRH"]
["ARM270240","ARM270240 - 240V Swing gate operator for gates to 5 metres",591,1,{"$f":"IF(D9=0,\"\",COUNTIF($D$2:D9,\">0\"))","v":8},"ARM270240"]
["ARM290BI","ARM290BI - 12V Swing gate operator for gates to 6 metres",1537,1,{"$f":"IF(D10=0,\"\",COUNTIF($D$2:D10,\">0\"))","v":9},"ARM290BI"]
["HD5024EAC","HD5024EAC - 24 volt hydraulic operator (24 volts - 5.0 metres)",2288,1,{"$f":"IF(D11=0,\"\",COUNTIF($D$2:D11,\">0\"))","v":10},"HD5024EAC"]
["HD80","HD80 - 240 Volt hydraulic swing gate drive unit ",4145,1,{"$f":"IF(D12=0,\"\",COUNTIF($D$2:D12,\">0\"))","v":11},"HD80"]
["PRBSKITLH","PRBSKITLH - Left slide arm kit for PR articulated arm operator",340,1,{"$f":"IF(D13=0,\"\",COUNTIF($D$2:D13,\">0\"))","v":12},"PRBSKITLH"]
["650ARMKITSTF","650ARMKITSTF - Set of bolt together post brackets for ARM",56,1,{"$f":"IF(D14=0,\"\",COUNTIF($D$2:D14,\">0\"))","v":13},"650ARMKITSTF"]
["ARM25012","ARM25012 - 12V Swing gate operator for gates to 4 metres",770,1,{"$f":"IF(D15=0,\"\",COUNTIF($D$2:D15,\">0\"))","v":14},"ARM25012"]
["BOB3024DK","BOB3024DK - 24 volt swing gate operator (24 volts - 3.0 metres)",942,1,{"$f":"IF(D16=0,\"\",COUNTIF($D$2:D16,\">0\"))","v":15},"BOB3024DK"]
["BOB5024ANZ","BOB5024ANZ - 24 volt single gate operator (24 volts - 5.0 metres)",942,1,{"$f":"IF(D17=0,\"\",COUNTIF($D$2:D17,\">0\"))","v":16},"BOB5024ANZ"]
["R18BOX","R18BOX - Foundation box for R18FAST with s/steel cover. ",402,1,{"$f":"IF(D18=0,\"\",COUNTIF($D$2:D18,\">0\"))","v":17},"R18BOX"]
["R18FAST","R18FAST - 12 volt underground swing gate (12 volts - 1.2 metres)",909,1,{"$f":"IF(D19=0,\"\",COUNTIF($D$2:D19,\">0\"))","v":18},"R18FAST"]
["ALPHALH5500","ALPHALH5500 - 24 volt swing gate drive unit (24 volts - 5.5 metres)",1287,1,{"$f":"IF(D20=0,\"\",COUNTIF($D$2:D20,\">0\"))","v":19},"ALPHALH5500"]
["ALPHARH5500","ALPHARH5500 - 24 volt swing gate drive unit (24 volts - 5.5 metres)",1287,1,{"$f":"IF(D21=0,\"\",COUNTIF($D$2:D21,\">0\"))","v":20},"ALPHARH5500"]
["PRSNKIT","PRSNKIT - Rising arm kit for PR articulated arm operator",289,1,{"$f":"IF(D22=0,\"\",COUNTIF($D$2:D22,\">0\"))","v":21},"PRSNKIT"]
["TOM3024E","TOM3024E - 24 volt swing gate operator (24 volts - 3.0 metres)",961,1,{"$f":"IF(D23=0,\"\",COUNTIF($D$2:D23,\">0\"))","v":22},"TOM3024E"]
["TOM5024E","TOM5024E - 24 volt single gate operator (24 volts - 5.0 metres)",1113,1,{"$f":"IF(D24=0,\"\",COUNTIF($D$2:D24,\">0\"))","v":23},"TOM5024E"]
["R50","R50 - Jockey wheel swing gate drive unit. (240 volts - 11.0 metres)",7710,1,{"$f":"IF(D25=0,\"\",COUNTIF($D$2:D25,\">0\"))","v":24},"R50"]
["R60","R60 - Jockey wheel type swing gate drive unit.",21288,1,{"$f":"IF(D26=0,\"\",COUNTIF($D$2:D26,\">0\"))","v":25},"R60"]
["OUTSWING","OUTSWING - Outswing linear motor bracket",76,1,{"$f":"IF(D27=0,\"\",COUNTIF($D$2:D27,\">0\"))","v":26},"OUTSWING"]
["ASAEXTPOSTBRAC","ASAEXTPOSTBRAC - Long post bracket for ASA motors",38,1,{"$f":"IF(D28=0,\"\",COUNTIF($D$2:D28,\">0\"))","v":27},"ASAEXTPOSTBRAC"]
["ASA30012VRH","ASA30012VRH - swing gate motor - right hand (12 volts - 3.0 metres)",584,1,{"$f":"IF(D29=0,\"\",COUNTIF($D$2:D29,\">0\"))","v":28},"ASA30012VRH"]
["ASA30012VLH","ASA30012VLH - swing gate motor - left hand (12 volts - 3.0 metres)",584,1,{"$f":"IF(D30=0,\"\",COUNTIF($D$2:D30,\">0\"))","v":29},"ASA30012VLH"]
["ASA60012VRH","ASA60012VRH - swing gate motor - right hand (12 volts - 5.0 metres)",607,1,{"$f":"IF(D31=0,\"\",COUNTIF($D$2:D31,\">0\"))","v":30},"ASA60012VRH"]
["ASA60012VLH","ASA60012VLH - swing gate motor - left hand (12 volts - 5.0 metres)",607,1,{"$f":"IF(D32=0,\"\",COUNTIF($D$2:D32,\">0\"))","v":31},"ASA60012VLH"]
["JOINTMASTER","JOINTMASTER - Articulated arm master side. (240 volts - 4.0 metres)",2979,1,{"$f":"IF(D33=0,\"\",COUNTIF($D$2:D33,\">0\"))","v":32},"JOINTMASTER"]
["JOINTSLAVE","JOINTSLAVE - Articulated arm slave side. (240 volts - 4.0 metres)",2556,1,{"$f":"IF(D34=0,\"\",COUNTIF($D$2:D34,\">0\"))","v":33},"JOINTSLAVE"]
["DUIT24NVE","DUIT24NVE - 24 volt underground motor (24 volts - 3.5 metres)",1113,1,{"$f":"IF(D35=0,\"\",COUNTIF($D$2:D35,\">0\"))","v":34},"DUIT24NVE"]
["DUITFOUNDATION","DUITFOUNDATION - Foundation box for DUIT24NVE",390,1,{"$f":"IF(D36=0,\"\",COUNTIF($D$2:D36,\">0\"))","v":35},"DUITFOUNDATION"]
["DUIT90RELEASE","DUIT90RELEASE - 90 degree opening kit for DUIT24NVE",246,1,{"$f":"IF(D37=0,\"\",COUNTIF($D$2:D37,\">0\"))","v":36},"DUIT90RELEASE"]
["DUIT180RELEASE","DUIT180RELEASE - 180 degree opening kit for DUIT24NVE",460,1,{"$f":"IF(D38=0,\"\",COUNTIF($D$2:D38,\">0\"))","v":37},"DUIT180RELEASE"]
["TONEKIT5E","TONEKIT5E - Sliding gate kit with two remotes (240 volt - 500kg)",1007,1,{"$f":"IF(D39=0,\"\",COUNTIF($D$2:D39,\">0\"))","v":38},"TONEKIT5E"]
["SLIDEDAMPER","SLIDEDAMPER - Hydraulic damper for slide gates to 30 NM",1680,1,{"$f":"IF(D40=0,\"\",COUNTIF($D$2:D40,\">0\"))","v":39},"SLIDEDAMPER"]
["TONEKIT6B","TONEKIT6B - Kit with two remotes and photocells. (12 volt - 600kg)",1311,1,{"$f":"IF(D41=0,\"\",COUNTIF($D$2:D41,\">0\"))","v":40},"TONEKIT6B"]
["MASTER18QR","MASTER18QR - Sliding motor with logic control, (12 volt - 1800kg)",1643,1,{"$f":"IF(D42=0,\"\",COUNTIF($D$2:D42,\">0\"))","v":41},"MASTER18QR"]
["TONEKIT8E","TONEKIT8E - Kit with two remotes and photocell. (240 volt - 800kg)",1162,1,{"$f":"IF(D43=0,\"\",COUNTIF($D$2:D43,\">0\"))","v":42},"TONEKIT8E"]
["TONEKITXLE","TONEKITXLE - Kit with two remotes and photocell. (240 volt - 1200kg)",1230,1,{"$f":"IF(D44=0,\"\",COUNTIF($D$2:D44,\">0\"))","v":43},"TONEKITXLE"]
["TAUKB4","TAUKB4 - Battery charge module",128,1,{"$f":"IF(D45=0,\"\",COUNTIF($D$2:D45,\">0\"))","v":44},"TAUKB4"]
["TAUBATTKIT","TAUBATTKIT - Battery charge module + battery",158,1,{"$f":"IF(D46=0,\"\",COUNTIF($D$2:D46,\">0\"))","v":45},"TAUBATTKIT"]
["DIAMONDBATT","DIAMONDBATT - Battery backup cable for TAU Diamond boards",7.3000000000000007,1,{"$f":"IF(D47=0,\"\",COUNTIF($D$2:D47,\">0\"))","v":46},"DIAMONDBATT"]
["BULL424SW","BULL424SW - Sliding gate motor with logic control. (24 volt - 450kg)",1024,1,{"$f":"IF(D48=0,\"\",COUNTIF($D$2:D48,\">0\"))","v":47},"BULL424SW"]
["BULLSWBATTMOD","BULLSWBATTMOD - Backup module for  BULL424SW",129,1,{"$f":"IF(D49=0,\"\",COUNTIF($D$2:D49,\">0\"))","v":48},"BULLSWBATTMOD"]
["CBY24VBATTBUP","CBY24VBATTBUP - Backup kit BULL424, BULL624 and BEAUTY",284,1,{"$f":"IF(D50=0,\"\",COUNTIF($D$2:D50,\">0\"))","v":49},"CBY24VBATTBUP"]
["TONEKIT10B","TONEKIT10B - Kit with two remotes and photocells. (12 volt - 1000kg)",1446,1,{"$f":"IF(D51=0,\"\",COUNTIF($D$2:D51,\">0\"))","v":50},"TONEKIT10B"]
["BULL624TURBO","BULL624TURBO - Sliding motor with logic control. (24 volt - 600kg) ",1724,1,{"$f":"IF(D52=0,\"\",COUNTIF($D$2:D52,\">0\"))","v":51},"BULL624TURBO"]
["SYNCMODULE","SYNCMODULE - Module to sync two automations.",157,1,{"$f":"IF(D53=0,\"\",COUNTIF($D$2:D53,\">0\"))","v":52},"SYNCMODULE"]
["BIG18","BIG18 - Sliding gate motor with logic control. (240 volt - 2500kg) ",2194,1,{"$f":"IF(D54=0,\"\",COUNTIF($D$2:D54,\">0\"))","v":53},"BIG18"]
["INVERTER","INVERTER - Single phase to 3 phase inverter",478,1,{"$f":"IF(D55=0,\"\",COUNTIF($D$2:D55,\">0\"))","v":54},"INVERTER"]
["RACK1020","RACK1020 - Steel reinforced sliding gate rack - 1020mm",24,1,{"$f":"IF(D56=0,\"\",COUNTIF($D$2:D56,\">0\"))","v":55},"RACK1020"]
["RACK1000","RACK1000 - Steel reinforced sliding gate rack - 1000mm",24,1,{"$f":"IF(D57=0,\"\",COUNTIF($D$2:D57,\">0\"))","v":56},"RACK1000"]
["RACKSTEEL","RACKSTEEL  - 1 metre galv steel sliding gate rack with fix angle",41,1,{"$f":"IF(D58=0,\"\",COUNTIF($D$2:D58,\">0\"))","v":57},"RACKSTEEL"]
["LEPUSFAST","LEPUSFAST - Ind slider to 27 mtrs per minute. (240 volt - 2500kg)",4320,1,{"$f":"IF(D59=0,\"\",COUNTIF($D$2:D59,\">0\"))","v":58},"LEPUSFAST"]
["BISON25","BISON25 - Industrial slider with inverter. (240 volt - 2500kg)",4676,1,{"$f":"IF(D60=0,\"\",COUNTIF($D$2:D60,\">0\"))","v":59},"BISON25"]
["BIG40QI","BIG40QI - Sliding gate motor with logic control. (240 volt - 4000kg) ",6174,1,{"$f":"IF(D61=0,\"\",COUNTIF($D$2:D61,\">0\"))","v":60},"BIG40QI"]
["BULL1524","BULL1524 - Sliding gate motor with logic control. (24 volt - 1500kg)",2144,1,{"$f":"IF(D62=0,\"\",COUNTIF($D$2:D62,\">0\"))","v":61},"BULL1524"]
["BULL1524BATT","BULL1524BATT - Battery backup kit for BULL1524",56,1,{"$f":"IF(D63=0,\"\",COUNTIF($D$2:D63,\">0\"))","v":62},"BULL1524BATT"]
["CHAIN5M","CHAIN5M - Chain five metre: require width plus one metre",170,1,{"$f":"IF(D64=0,\"\",COUNTIF($D$2:D64,\">0\"))","v":63},"CHAIN5M"]
["ASA612","ASA612  - Sliding gate motor with logic control. (12 volt - 600kg)",872,1,{"$f":"IF(D65=0,\"\",COUNTIF($D$2:D65,\">0\"))","v":64},"ASA612"]
["CHAINENDS","CHAINENDS - Pair of end clamps for chain drive",201,1,{"$f":"IF(D66=0,\"\",COUNTIF($D$2:D66,\">0\"))","v":65},{"$f":"IFERROR(INDEX(A:A,MATCH(ROW(D65),E:E,0)),\"\")","v":"CHAINENDS"}]
["MASTER20QRA","MASTER20QRA - Sliding motor with logic control. (240 volt - 2000kg) ",1353,{"$f":"IFERROR(SEARCH(INDIRECT(CELL(\"address\")),A67),0)","v":1},{"$f":"IF(D67=0,\"\",COUNTIF($D$2:D67,\">0\"))","v":66},"MASTER20QRA"]
["MASTER20CHAIN","MASTER20CHAIN - Sliding gate motor with chain drive",1638,1,{"$f":"IF(D68=0,\"\",COUNTIF($D$2:D68,\">0\"))","v":67},"MASTER20CHAIN"]
["REMGR","REMGR  - Four channel 433 mhz keyring style transmitter",50,1,{"$f":"IF(D69=0,\"\",COUNTIF($D$2:D69,\">0\"))","v":68},"REMGR"]
["REMKEY","REMKEY - Four channel Key Automation transmitter.",109,1,{"$f":"IF(D70=0,\"\",COUNTIF($D$2:D70,\">0\"))","v":69},"REMKEY"]
["REMBENINCA","REMBENINCA- Four channel Beninca transmitter.",69,1,{"$f":"IF(D71=0,\"\",COUNTIF($D$2:D71,\">0\"))","v":70},"REMBENINCA"]
["RECBENINCASA","RECBENINCASA- Two channel Beninca receiver.",128,1,{"$f":"IF(D72=0,\"\",COUNTIF($D$2:D72,\">0\"))","v":71},"RECBENINCASA"]
["REMMICRO","REMMICRO- Four channel transmitter.",60,1,{"$f":"IF(D73=0,\"\",COUNTIF($D$2:D73,\">0\"))","v":72},"REMMICRO"]
["REMBEAUTY","REMBEAUTY- Two channel transmitter.",72,1,{"$f":"IF(D74=0,\"\",COUNTIF($D$2:D74,\">0\"))","v":73},"REMBEAUTY"]
["GATEBOX","GATEBOX - WiFi remote control module with phone app.",165,1,{"$f":"IF(D75=0,\"\",COUNTIF($D$2:D75,\">0\"))","v":74},"GATEBOX"]
["GSMREMOTE","GSMREMOTE - GSM remote control for control by phone.",397,1,{"$f":"IF(D76=0,\"\",COUNTIF($D$2:D76,\">0\"))","v":75},"GSMREMOTE"]
["SHERLOTX4","SHERLOTX4  - 4channel long range transmitter - Keyring style.",91,1,{"$f":"IF(D77=0,\"\",COUNTIF($D$2:D77,\">0\"))","v":76},"SHERLOTX4"]
["SHERLOWMTX","SHERLOWMTX - Single channel outdoor long range pushbutton ",173,1,{"$f":"IF(D78=0,\"\",COUNTIF($D$2:D78,\">0\"))","v":77},"SHERLOWMTX"]
["SHERLOCOMRX","SHERLOCOMRX - Complex receiver 2000 user",473,1,{"$f":"IF(D79=0,\"\",COUNTIF($D$2:D79,\">0\"))","v":78},"SHERLOCOMRX"]
["SHERLOTX1","SHERLOTX1  - Single channel long range transmitter - Keyring style.",73,1,{"$f":"IF(D80=0,\"\",COUNTIF($D$2:D80,\">0\"))","v":79},"SHERLOTX1"]
{"$rows_left_out":711}
{"sheet":"Notes","index":3,"n_rows":17,"n_cols":3,"rows_kept":17,"cut":false,"hidden":true,"merged":[]}
[" "]
[null,"Quote Page"]
[null,1,"Nothing to change here on a regular basis unless you wish to update terms and conditions."]
[]
[null,2,"If you add or subtract rows there are three macros all refering to different cells which you may affect and need"]
[null,null,"to change"]
[]
[null,"Setup Page"]
[null,1,"No changes necessary."]
[]
[null,"Items Page "]
[null,1,"Each pricebook update requires new data to columns A, B and C. Cut and paste from price list excel file."]
[]
[null,2,"Do not change or remove ROW 1"]
[]
[null,3,"When you update the data in columns A, B and C you need to ensure that columns D, E and F all fill down to the"]
[null,null,"same number of rows as A, B and C. This will ensure the functions continue to work."]